The Puppet Labs Issue Tracker has Moved: https://tickets.puppetlabs.com

Activity

From 01/14/2012 to 01/20/2012

01/21/2012

11:13 pm Bug #12063 (Closed): Unable (sometimes) to set shell to empty
James Turnbull
09:26 pm Bug #12063: Unable (sometimes) to set shell to empty
There is no bug here, you can close this ticket.
We have determined the reason that these two hosts acted differen...
Dan Lowe
09:04 pm Bug #11930 (In Topic Branch Pending Review): Must use forward slashes when specifying a local mod...
Josh Cooper
04:24 pm Puppet Dashboard Bug #11365 (Accepted): Possible XSS vulnterability in Dashboard
Patches for dashboard and jquery applied to pe-dashboard versions (1.0.4, 1.2.0, 1.2.4) corresponding to PE (1.0/1.1,... Matthaus Owens

01/20/2012

03:56 pm Puppet Acceptance Feature #11767: Acceptance tests don't run on Windows
Merged in master <https://github.com/puppetlabs/puppet-acceptance/commit/071e945c0e216dd18e6fd5cace79072c5a4167a4> an... Josh Cooper
03:17 pm Bug #7680: Checksum missmatch when copying followed symlinks
Tested on 2.7.9, same issue confirmed. I tried the proposed patch in comment 6, and it resolved the issue. I cannot c... Corey Hickey
02:53 pm Feature #6725 (Unreviewed): Serial # for x509 certificates
Ben Hughes
02:53 pm Feature #5783 (Unreviewed): support HTTP(S) URL as the file 'source'
Ben Hughes
02:53 pm Bug #4946 (Unreviewed): Dependency abbreviations incorrectly parsed
Ben Hughes
02:53 pm Bug #4415 (Unreviewed): puppetd ignores resources in the catalog if the type code cannot be found
Ben Hughes
02:53 pm Bug #4241 (Unreviewed): Cron type behavior change
Ben Hughes
02:53 pm Bug #4131 (Unreviewed): resources using parsedfile providers quietly move resources from default ...
Ben Hughes
02:53 pm Bug #4076 (Unreviewed): Naginator creates config it can't parse
Ben Hughes
02:53 pm Feature #4072 (Unreviewed): Add remove/uninstall feature to zypper.rb
Ben Hughes
02:53 pm Bug #4036 (Unreviewed): puppetca without options fails
Ben Hughes
02:53 pm Feature #3950 (Unreviewed): Service notifies should be able to specify a type of restart/reload
Ben Hughes
02:53 pm Bug #3939 (Unreviewed): ALLCAPS variables arent usable in templates.
Ben Hughes
02:53 pm Bug #3904 (Unreviewed): Received annoying alert mails and reports after set "checksum => none" on...
Ben Hughes
02:53 pm Bug #3850 (Unreviewed): newaliases generates incorrect aliases file on openbsd
Ben Hughes
02:53 pm Bug #3803 (Unreviewed): Updated function creates namespace load order conflict.
Ben Hughes
02:53 pm Bug #3796 (Unreviewed): zfs.rb does not support user properties
Ben Hughes
02:53 pm Bug #3758 (Unreviewed): node inheritance locks scope
Ben Hughes
02:53 pm Bug #3726 (Unreviewed): puppet sometimes incorrectly expands templates
Ben Hughes
02:52 pm Feature #3698 (Unreviewed): messages sometimes include exec command where exec title is expected
Ben Hughes
02:52 pm Bug #3648 (Unreviewed): autorequire failure with subdirectory inside recursive file resource
Ben Hughes
02:52 pm Feature #3645 (Unreviewed): no easy way to push cert signing request from client to server
Ben Hughes
02:52 pm Bug #3567 (Unreviewed): 'Puppet::Type::Mount::ProviderParsed Puppet::Type::Mount::ProviderParsed ...
Ben Hughes
02:52 pm Bug #3564 (Unreviewed): Puppet::ParseError in 'Puppet::Parser::Compiler should be able to determi...
Ben Hughes
02:52 pm Bug #3563 (Unreviewed): Spec test FAILED: 'Puppet::Type::File when writing files should fail if n...
Ben Hughes
02:52 pm Bug #3526 (Unreviewed): Unhelpful error message init.pp files are set to incorrect permissions
Ben Hughes
02:52 pm Bug #3421 (Unreviewed): Insufficient debug info from pson versus yaml
Ben Hughes
02:52 pm Bug #3354 (Unreviewed): puppet/util/settings/file_setting.rb should internalize strings when chec...
Ben Hughes
02:52 pm Bug #3313 (Unreviewed): puppet.conf option client=true/false doesn't seem to work
Ben Hughes
02:52 pm Bug #3235 (Unreviewed): Puppet only runs once sucessfully with factor libraries
Ben Hughes
02:52 pm Feature #3170 (Unreviewed): Please re-introduce checksum => nosum for file resources
Ben Hughes
02:52 pm Bug #3081 (Unreviewed): Unable to specify absence of host host_aliases
Ben Hughes
02:52 pm Bug #3052 (Unreviewed): Puppet could expose EMLINK a bit better
Ben Hughes
02:52 pm Bug #3023 (Unreviewed): Tests needed to show that "exec"ed scripts don't get parents stdin/stdout...
Ben Hughes
02:52 pm Feature #2988 (Unreviewed): inconsistent array flattening
Ben Hughes
02:52 pm Refactor #2969 (Unreviewed): Convert Test::Unit tests to RSpec
Ben Hughes
02:52 pm Bug #2961 (Unreviewed): Test Failed: Puppet::SSLCertificates::Support::MissingCertificate in 'pup...
Ben Hughes
02:52 pm Feature #2956 (Unreviewed): The parser should use 'futures' for lazy-resolving rvalues
Ben Hughes
02:52 pm Bug #2834 (Unreviewed): external node classifier should take client's idea of the environment int...
Ben Hughes
02:52 pm Bug #2701 (Unreviewed): Memory Leak in Puppet state
Ben Hughes
02:52 pm Refactor #2630 (Unreviewed): Sourced files are checksummed twice
Ben Hughes
02:52 pm Bug #2193 (Unreviewed): Exec's "command" parameter should accept lists in addition to strings
Ben Hughes
02:52 pm Bug #2156 (Unreviewed): provider/service/freebsd.rb cannot handle service name containing 'dash'
Ben Hughes
02:52 pm Bug #2118 (Unreviewed): Puppetmasterd should finish operations when restarting
Ben Hughes
02:52 pm Refactor #2056 (Unreviewed): Runit and launchd service providers ignores explicit 'stop' command
Ben Hughes
02:52 pm Bug #1670 (Unreviewed): Mount parameters "dump" and "pass" should default to undefined
Ben Hughes
02:52 pm Bug #1395 (Unreviewed): puppet memory usage
Ben Hughes
02:52 pm Bug #1372 (Unreviewed): Class names that match the node name are not evaluated
Ben Hughes
02:51 pm Feature #708 (Unreviewed): User and Group providers should directly parse /etc/passwd and /etc/group
Ben Hughes
02:51 pm Bug #83 (Unreviewed): Puppet should be lexically scoped, not dynamically scoped
Ben Hughes
02:51 pm Bug #6633 (Unreviewed): Mount provider remounts unnecessarily
Ben Hughes
02:51 pm Bug #6628 (Unreviewed): Parsed file providers fail to replace missing entries on first run where ...
Ben Hughes
02:51 pm Bug #6548 (Unreviewed): State.yaml should store state after updates
Ben Hughes
02:51 pm Bug #6411 (Unreviewed): Changing mount device when ensuring unmounted causes bogus mount of new d...
Ben Hughes
02:51 pm Bug #6409 (Unreviewed): Mount provider should reject spaces in fstab fields
Ben Hughes
02:51 pm Bug #6404 (Unreviewed): Filebucket app should complain when no files given
Ben Hughes
02:51 pm Refactor #6094 (Unreviewed): Reduce the number of implementations of insync
Ben Hughes
02:51 pm Bug #5894 (Unreviewed): Failed inspect events are counted as out of sync
Ben Hughes
02:51 pm Refactor #5886 (Unreviewed): Run mode appears to be settable after initialization but there is no...
Ben Hughes
02:51 pm Bug #5850 (Unreviewed): XMLRPC interface to filebucket should be removed
Ben Hughes
02:51 pm Feature #5703 (Unreviewed): Print output from postrun_command and prerun_command
Ben Hughes
02:51 pm Bug #5698 (Unreviewed): Use of :absent and nil is inconsistent in inspect reports
Ben Hughes
02:51 pm Bug #5472 (Unreviewed): No error message if we fail to push a report to Dashboard
Ben Hughes
02:51 pm Bug #5471 (Unreviewed): Change default dashboard report url to /reports/upload
Ben Hughes
02:51 pm Bug #5244 (Unreviewed): Pluginsync overwrites local plug-ins
Ben Hughes
02:51 pm Feature #5044 (Unreviewed): Autoloading order improvements
Ben Hughes
02:51 pm Bug #5042 (Unreviewed): Node declarations shouldn't be allowed inside classes
Ben Hughes
02:51 pm Bug #4826 (Unreviewed): It is difficult to verify that options don't overlap
Ben Hughes
02:51 pm Bug #4473 (Unreviewed): Parent class name is resolved within namespace of class being defined
Ben Hughes
02:50 pm Bug #6944 (Unreviewed): generate_additional_resources in transaction drops recursed values
Ben Hughes
02:50 pm Refactor #6759 (Unreviewed): Improve internal option handling pattern
Ben Hughes
02:50 pm Refactor #6753 (Unreviewed): Faces should be available as `puppet ${face}` without a stub `lib/pu...
Ben Hughes
02:50 pm Refactor #6493 (Unreviewed): Puppet Module Tool should be a Face, and ship with Puppet
Ben Hughes
02:50 pm Bug #5369 (Unreviewed): Autorequire loop resolution inadequate
Ben Hughes
02:50 pm Bug #5200 (Unreviewed): Many-to-many implementation of stages needlessly inefficient
Ben Hughes
02:50 pm Refactor #4862 (Unreviewed): Only a small portion of the vendored event-queue library is needed
Ben Hughes
02:50 pm Bug #4732 (Unreviewed): Use of .pp/.rb extention to sniff file type breaks "everything is pp" ass...
Ben Hughes
02:50 pm Bug #4687 (Unreviewed): Implicit classes not being propogated
Ben Hughes
02:50 pm Bug #4274 (Unreviewed): Invalid option help wording
Ben Hughes
02:50 pm Bug #3955 (Unreviewed): Specifying file content by checksum should not use 'content' property
Ben Hughes
02:50 pm Bug #3705 (Unreviewed): Sporadic test failure in spec/unit/resource/catalog.rb
Ben Hughes
02:50 pm Bug #3505 (Unreviewed): Sporadic unit test failures in test/ral/providers/user.rb
Ben Hughes
02:50 pm Bug #3118 (Unreviewed): Default node definition should not be required when ENC returns a node de...
Ben Hughes
02:50 pm Bug #3032 (Unreviewed): Race condition in SELinux mount handling
Ben Hughes
02:50 pm Refactor #3000 (Unreviewed): Normalize package providers' treatment of absent packages
Ben Hughes
02:50 pm Bug #2908 (Unreviewed): Rails resources are sometimes untagged
Ben Hughes
02:50 pm Bug #2884 (Unreviewed): Test isolation: spec/unit/property/keyvalue.rb generates 6 spurious errors
Ben Hughes
02:50 pm Bug #2861 (Unreviewed): Test isolation: spec/unit/type/schedule.rb has a spurious failure if run ...
Ben Hughes
02:50 pm Refactor #2623 (Unreviewed): authstore.rb needs to be refactored
Ben Hughes
02:50 pm Feature #2587 (Unreviewed): Logging
Ben Hughes
02:50 pm Feature #2576 (Unreviewed): Time stamps in the --debug output could be useful
Ben Hughes
02:50 pm Feature #2561 (Unreviewed): Test needed for all CLI option combinations
Ben Hughes
02:50 pm Facter Bug #6365 (Unreviewed): Plist parser can segfault
Ben Hughes
02:50 pm Refactor #7197 (Unreviewed): Prevent a resource from having two parents
Ben Hughes
02:50 pm Bug #6501 (Unreviewed): Ruby DSL doesn't produce useful backtraces
Ben Hughes
02:50 pm Bug #5839 (Unreviewed): puppet filebucket -s doesn't work
Ben Hughes
02:50 pm Bug #5714 (Unreviewed): Use of :absent and :notlink for File/target is inconsistent in state.yml
Ben Hughes
02:50 pm Bug #5584 (Unreviewed): Intermittent failure in spec/unit/parser/compiler_spec.rb
Ben Hughes
02:50 pm Feature #4797 (Unreviewed): Providers should be able to process more than one resource at a time
Ben Hughes
02:49 pm Feature #4784 (Unreviewed): Allow different defaults for different run_modes
Ben Hughes
02:49 pm Feature #4634 (Unreviewed): Add puppet agent --filter
Ben Hughes
02:49 pm Feature #4582 (Unreviewed): Pileline compiled catalogs to and from STDIN
Ben Hughes
02:49 pm Bug #4184 (Unreviewed): mount will produce invalid fstab records if "options" or "fstype" are unset
Ben Hughes
02:49 pm Bug #4107 (Unreviewed): puppet kick ignores --noop, and it isn't clear what the correct behavior ...
Ben Hughes
02:49 pm Feature #3868 (Unreviewed): disable use_cached_catalog in puppet kick
Ben Hughes
02:49 pm Bug #3714 (Unreviewed): Serialize as JSON instead of YAML for cached catalog
Ben Hughes
02:49 pm Bug #3642 (Unreviewed): replace RDoc::usage with something appropriate for single executable
Ben Hughes
02:49 pm Feature #3641 (Unreviewed): "Import" statements should not be allowed inside of other control str...
Ben Hughes
02:49 pm Bug #3372 (Unreviewed): Replace FileBucket Dipper with more idiomatic calls
Ben Hughes
02:49 pm Feature #3371 (Unreviewed): FileBucket should not keep files in memory
Ben Hughes
02:49 pm Bug #3166 (Unreviewed): Ralsh throws an error in querying/modifying existing host
Ben Hughes
02:49 pm Bug #3031 (Unreviewed): Non-functional monkeypatch on Net::HTTP
Ben Hughes
02:49 pm Bug #3030 (Unreviewed): Insufficiently specific error message when a fileserver module doesn't exist
Ben Hughes
02:46 pm Bug #3031 (Accepted): Non-functional monkeypatch on Net::HTTP
Anonymous
02:45 pm Bug #3030 (Accepted): Insufficiently specific error message when a fileserver module doesn't exist
Anonymous
02:45 pm Bug #3166 (Accepted): Ralsh throws an error in querying/modifying existing host
Anonymous
02:44 pm Bug #3166 (Investigating): Ralsh throws an error in querying/modifying existing host
Anonymous
02:43 pm Bug #3031 (Investigating): Non-functional monkeypatch on Net::HTTP
Anonymous
02:43 pm Bug #3030 (Investigating): Insufficiently specific error message when a fileserver module doesn't...
Anonymous
02:29 pm Bug #3010 (Unreviewed): Crontab entries using "special" parameter can't be converted to non-speci...
Ben Hughes
02:02 pm Bug #12063 (Closed): Unable (sometimes) to set shell to empty
I ran into this today:
(/Stage[main]/Users::Accounts/Useraccount[lp]/User[lp]/shell) change from /bin/false to...
Dan Lowe
01:18 pm Facter Bug #12012: Facter globally overrides LANG environment variable at load time
Updated the branch: https://github.com/puppetlabs/facter/pull/149 Anonymous
01:16 pm Bug #7173: Puppet master can't submit reports to an HTTP server using basic auth
Jason Antman wrote:
> Is there any update on this?
Hey there. Not at this stage - part of the reason for the wee...
Anonymous
12:11 pm Bug #7173: Puppet master can't submit reports to an HTTP server using basic auth
Is there any update on this? Jason Antman
11:50 am Feature #12060 (Closed): Remove factsync
Factsync has been deprecated since 0.25 (#2277). Time to take it out. Patrick Carlisle
07:25 am Bug #12052 (Accepted): No error message printed if package installation fails due to broken depen...
When using a package statement to install a package, and that package has broken dependencies, puppet continues witho... Thomas Nygreen
06:44 am Bug #12051 (Closed): Exec onlyif / unless does not capture output
Puppet does not log the output of a check command to an exec, even if logoutput is true. There are no other facilitie... Robert Buchholz
04:52 am Bug #12050 (Accepted): Use of metaparameters inside defines are incorrectly reported as dynamic v...
Consider this
I have a define:
define A($x) {
...
if $require {
SomeResource["name"] {...
Tejas Viswanath
10:27 pm Feature #11900: Dynamic environment interpolation in puppet master configuration
eric sorenson wrote:
> > Is it possible for you to generate directories based upon the possible values of the two ke...
Nigel Kersten
10:03 pm Feature #11900: Dynamic environment interpolation in puppet master configuration
Nigel Kersten wrote:
> I genuinely don't know as I haven't tried it.... maybe? :)
I'll give it a try once I'm bac...
eric sorenson
09:47 pm Feature #11900: Dynamic environment interpolation in puppet master configuration
eric sorenson wrote:
> I understand all you've written nigel and I still would like the ability to break the environ...
Nigel Kersten
09:44 pm Feature #11900: Dynamic environment interpolation in puppet master configuration
Mike McLane wrote:
> Oh! I was unaware that the master detects changes in the conf and reloads the config files. Do...
Nigel Kersten
05:51 pm Puppet Forge Feature #11979 (Merged - Pending Release): Update existing Forge API - dependency metadata
This will go out once #12046 is addressed. Matt Robinson
05:50 pm Puppet Forge Bug #11856 (Merged - Pending Release): Getting the forge setup and passing tests should be docume...
This has been merged, but some coordination with Ops will be necessary to get it deployed. That's what #12046 descri... Matt Robinson
05:41 pm Feature #11727: Add stdin parsing to puppet parser validate
testing merged at <https://github.com/puppetlabs/puppet/commit/9906852c67c298f9a27ffeac492cd9073dc6d109> Michael Stahnke
05:18 pm Facter Bug #12012 (In Topic Branch Pending Review): Facter globally overrides LANG environment variable ...
Chris Price
05:03 pm Facter Bug #11823: is_virtual is broken in CentOS 6.x
I can confirm this is an issue on CentOS 6.0 running the VMWare Extensions 6 and Puppet Enterprise 2.0
There is no...
Geoff Davis
04:46 pm Feature #11900: Dynamic environment interpolation in puppet master configuration
I understand all you've written nigel and I still would like the ability to break the environment into two keys; spec... eric sorenson

01/19/2012

03:29 pm Bug #11961: pypi is down leading to "Could not run Puppet configuration client: execution expired"
James Turnbull wrote:
> We'll need to wrap something in the def latest block to check if the site is up.
Probably...
Anonymous
03:24 pm Bug #4694: Storeconfig issue with AR/MySQL
James Turnbull wrote:
> Daniel - which ticket is it a duplicate of?
#3581, since it is caused by the `fork` insid...
Anonymous
03:20 pm Bug #9145: error message is not clear when puppet agent runs out of disk space during cert genera...
Ryan Conway wrote:
> Sure, I understand!
>
> My only suggestion then would be to just make the file handling more...
Anonymous
03:03 pm Facter Bug #12012: Facter globally overrides LANG environment variable at load time
Updated plan after consultation with Daniel:
* Don't worry about the existence of a "with_env" in both facter and ...
Chris Price
03:00 pm Facter Bug #12012: Facter globally overrides LANG environment variable at load time
master is going to be 1.7.x, we're hoping to get external facts and caching merged into that release, and then struct... Adrien Thebo
02:54 pm Facter Bug #12012: Facter globally overrides LANG environment variable at load time
Adrien Thebo wrote:
> it strikes me that the execution functionality might need to be either pulled out of both libr...
Chris Price
02:10 pm Feature #11727 (Merged - Pending Release): Add stdin parsing to puppet parser validate
This is merged into master, and should shortly merge into 2.7.10, pending confirmation that it actually passes tests. Anonymous
02:04 pm Puppet Acceptance Bug #9538 (Closed): should not evaluate answers file unless it is a PE test
setup/early/01-gen-answer-file.rb now contains the logic that skips the step unless it is a PE install:... Dominic Maraglia
01:59 pm Puppet Acceptance Feature #11767 (Merged - Pending Release): Acceptance tests don't run on Windows
Merged Dominic Maraglia
01:55 pm Facter Bug #12012: Facter globally overrides LANG environment variable at load time
Chris Price wrote:
> Rather than globally modifying this variable we probably need to temporarily override it when...
Anonymous
01:53 pm Puppet Acceptance Feature #5570 (Closed): Add applicability test to harness DSL
wow, yes I added skip_test method ages ago. Closing. Dominic Maraglia
01:40 pm Puppet Acceptance Feature #11767: Acceptance tests don't run on Windows
Reviewed and commented on the pull request.
-Jeff
Jeff McCune
01:32 pm Bug #11860: Puppet ovewriting the LANG environment variable.
Considerations:
It seems like the main code path in question here is the "execute" method in Puppet::Util. This is ...
Chris Price
01:03 pm Facter Bug #12012: Facter globally overrides LANG environment variable at load time
There's been a periodic discussion of merging Facter's and Puppet's execution code. I would be in favor of a solution... Adrien Thebo
12:48 pm Bug #11860: Puppet ovewriting the LANG environment variable.
Chris Price wrote:
> There is a line that gets run on Facter [...] where we seem to be always setting this; thus the...
Chris Price
12:29 pm Facter Bug #12012 (Closed): Facter globally overrides LANG environment variable at load time
In facter.rb, ~ line 41-44, we have this:
# Set LANG to force i18n to C
#
ENV['LANG'] = 'C'
Thi...
Chris Price
11:54 am Puppet Acceptance Feature #5570: Add applicability test to harness DSL
Dom, you added skip_test, right? Josh Cooper
11:37 am Puppet Acceptance Feature #11767 (In Topic Branch Pending Review): Acceptance tests don't run on Windows
This pull request allows new acceptance tests to be written that will run on Windows agents. It does not cover gettin... Josh Cooper
10:45 am Puppet Acceptance Bug #9629: FOSS tests are not portable to PE environment
NIgel, thanks for the input and the clarification.
The important thing to note here is that methods have been ad...
Dominic Maraglia
10:41 am Feature #11900: Dynamic environment interpolation in puppet master configuration
Oh! I was unaware that the master detects changes in the conf and reloads the config files. Does that reload just me... Mike McLane
10:35 am Bug #11830 (Accepted): API REST doesn't interpret environment
The issue here is that you can't set the environment using the REST API to trigger an agent run. Inspecting the code... Anonymous
10:29 am Bug #7754: pip provider does not detect existance of system installed packages
Chris Blumentritt wrote:
> Go ahead and reject this. Things are a lot different with -i
>
> pip freeze | grep -...
Anonymous
10:09 am Bug #11276: Get puppet module tool working on Windows
This shouldn't be targeted at a specific release until the code is merged; moved back to the branch. Anonymous
10:05 am Bug #11276: Get puppet module tool working on Windows
I'm unassigning this from myself since I'm not planning to work on this in the near future. Matt Robinson
09:57 am Bug #6830 (Re-opened): Specs should all pass under Ruby 1.9
Specs only pass on Ruby 1.9 if you filter out the once we've marked as failing. There are still 200 failures without... Matt Robinson
09:53 am Feature #11900: Dynamic environment interpolation in puppet master configuration
Mike McLane wrote:
> Thank you for looking into this Nigel.
>
> Yes, I believe those involved with this thread under...
Nigel Kersten
09:39 am Feature #11900: Dynamic environment interpolation in puppet master configuration
Thank you for looking into this Nigel.
Yes, I believe those involved with this thread understand how dynamic envir...
Mike McLane
09:27 am Feature #11900: Dynamic environment interpolation in puppet master configuration
I'm just checking that everyone here realizes that we have the ability to dynamically determine environments now.
...
Nigel Kersten
05:53 am Refactor #11273 (Closed): init.pp template for module face should be more thorough.
Kelsey Hightower
03:24 am Bug #3741: Custom facts loaded multiple times
Up until now I had the habit of moving all my facter plugins into their own directory for categorization or to simply... Mikael Fridh
12:54 am Bug #11051: Unrecognised escape sequence '\`' in file (escaped backtick in manifest)
Hi,
Sorry for my late reply.
We tested the work-around with the double back-slash before the backtick.
-> It wor...
Egon Kastelijn
08:06 pm Bug #11953 (Merged - Pending Release): apt::force doesn't actually do anything with $version
Matthaus Owens
07:25 pm Feature #11967: split() function does not work on array variables
I think it should be possible to use the same semantics, split($variable), but allow $variable to be either a string ... Steve Shipway
06:00 pm Feature #11967 (Needs More Information): split() function does not work on array variables
Can you elaborate more on the exact semantics you're looking for?
It looks like you want to split each array eleme...
Nigel Kersten
05:54 pm Feature #7788: Puppet should allow rubygems to deliver new functionality
That's a big hammer to solve a small problem.
I guess to invert it, what's the problem with distributing these plu...
Nigel Kersten
05:46 pm Bug #11860: Puppet ovewriting the LANG environment variable.
There is a line that gets run on Facter startup (facter/lib/facter.rb line 44):
# Set LANG to force i18n to C
...
Chris Price
04:57 pm Puppet Acceptance Bug #11764 (Merged - Pending Release): methods for running puppet handle blocks inconsistently
Merged into puppet-acceptance at https://github.com/puppetlabs/puppet-acceptance/commit/a9304da7346df1bd5356036a8b75b... Patrick Carlisle
04:56 pm Bug #9702: Issue with inventory PGError: ERROR: column "id" does not exist
I've been able to replicate this using Puppet Enterprise 2.0 on UbuntuLTS 32-bit (The ruby packaged is 1.8.7-p357 I b... Justin Stoller
04:53 pm Bug #11741 (Closed): acceptance tests use now invalid --certdnsnames argument
Merged in https://github.com/puppetlabs/puppet/commit/07da208a3e580337ad0bc94019b90e0fb8270a0e Patrick Carlisle
04:24 pm Bug #11740 (Re-opened): Puppet sometimes reports 'The handle is invalid'
The bug is still being worked on. The part that I fixed was the tests, while I work on the fix. Josh Cooper
04:01 pm Puppet Forge Feature #11979 (In Topic Branch Pending Review): Update existing Forge API - dependency metadata
Anonymous

01/18/2012

03:43 pm Feature #11990: PuppetDoc should use also README.rdoc files
Alessandro Franceschi wrote:
> No problem in signing a CLA, but the attached patch was done by Brice, so suppose is...
Anonymous
03:27 pm Feature #9997 (Closed): puppet should support the mysql2 gem
released in 2.7.10rc1 Michael Stahnke
03:26 pm Feature #9768 (Closed): create_resources should accept default values for all resources it creates
released in 2.7.10rc1 Michael Stahnke
03:26 pm Bug #9544 (Closed): package spec may fail if not run as root
released in 2.7.10rc1 Michael Stahnke
03:25 pm Bug #9158 (Closed): Puppet master breaks on trying to send message to stomp queue
released in 2.7.10rc1 Michael Stahnke
03:24 pm Bug #8547 (Closed): puppetstoredconfigclean checks only [master] for database configuration, shou...
Closed and released in 2.7.10rc1 Michael Stahnke
03:23 pm Bug #8341 (Closed): Loading facts repeatedly
released as part of 2.7.10rc1 Michael Stahnke
03:23 pm Bug #8119 (Closed): PATCH - Write to a temporary file and move when storing reports.
released 2.7.10rc1 Michael Stahnke
03:22 pm Bug #8062 (Closed): yum package ensure=>latest not checking the epoch tag
released as part of 2.7.10rc1 Michael Stahnke
03:20 pm Feature #11990: PuppetDoc should use also README.rdoc files
No problem in signing a CLA, but the attached patch was done by Brice, so suppose is not necessary. Alessandro Franceschi
03:18 pm Bug #7428 (Closed): Puppet cert fails on 1.9.2 with wrong number of arguments
released in 2.7.10rc1 Michael Stahnke
03:17 pm Bug #7296 (Closed): Debian service provider disables serivce when set to enable
released 2.7.10rc1 Michael Stahnke
03:17 pm Bug #7110 (Closed): Better SSL error message when retrieved certificate does not match private key
released in 2.7.10rc1 Michael Stahnke
03:16 pm Bug #7106 (Closed): last_run_summary.yaml is only readable by root
released in 2.7.10rc1 Michael Stahnke
03:11 pm Bug #6830 (Closed): Specs should all pass under Ruby 1.9
released in 2.7.10rc1 Michael Stahnke
03:11 pm Bug #6412 (Closed): Can not test hash key exist?, or array element exist? in puppet
released in 2.7.10rc1 Michael Stahnke
03:10 pm Feature #5421 (Closed): Fileresource: Link should autorequire target
released in 2.7.10rc1 Michael Stahnke
03:10 pm Bug #5246 (Closed): Puppetd does not remove it's pidfile when it exits
released in 2.7.10rc1 Michael Stahnke
03:09 pm Feature #4865 (Closed): Puppet debug mode should print resource type/title before resource evalua...
released in 2.7.10rc1 Michael Stahnke
03:09 pm Bug #4855 (Closed): group resources on OS X may fail is group members are non-existant
released in 2.7.10rc1 Michael Stahnke
03:08 pm Feature #4836 (Closed): puppetd --disable improvements
released in 2.7.10rc1 Michael Stahnke
03:08 pm Feature #3757 (Closed): --enable and --disable should be improved
released in 2.7.10rc1 Michael Stahnke
03:08 pm Bug #3419 (Closed): OS X 10.6 Ruby can't set supplementary groups
released in 2.7.10rc1 Michael Stahnke
03:07 pm Feature #2927 (Closed): Symbolic Modes for the File type.
released in 2.7.10rc1 Michael Stahnke
03:07 pm Bug #2773 (Closed): buglet in provider/service/launchd.rb
released in 2.7.10rc1 Michael Stahnke
03:06 pm Feature #1886 (Closed): Add node cleanup capability
released in 2.7.10rc1 Michael Stahnke
03:05 pm Bug #11958 (Closed): obscure error message from pip package provider when python-pip is not insta...
released in 2.7.10rc1 Michael Stahnke
03:05 pm Bug #11929 (Closed): Cannot serve local binary files on Windows
released at 2.7.10rc1 Michael Stahnke
03:04 pm Bug #11847 (Closed): puppet.bat cannot be relocated on Windows
released in 2.7.10rc1 Michael Stahnke
03:04 pm Bug #11844 (Closed): Fix command typo in exec documentation
released in 2.7.10rc1 Michael Stahnke
03:03 pm Bug #11740 (Closed): Puppet sometimes reports 'The handle is invalid'
released in 2.7.10rc1 Michael Stahnke
03:02 pm Bug #11717 (Closed): Windows ADSI user provider won't create users if a password policy is in place
released in 2.7.10rc1 Michael Stahnke
03:02 pm Bug #11714 (Closed): puppet --version returns Error: Unknown Puppet subcommand 'apply' on windows
released in 2.7.10rc1 Michael Stahnke
03:02 pm Bug #11641 (Closed): After 2.7.9 update, Tidy resource can only tidy a single file per run
released in 2.7.10rc1 Michael Stahnke
03:01 pm Bug #11499 (Closed): validation code for puppet resource host does not properly check if ip is valid
released in 2.7.10rc1 Michael Stahnke
03:01 pm Bug #11423 (Closed): Misleading error message when you import duplicate resources from StoreConfigs
released in 2.7.10rc1 Michael Stahnke
03:00 pm Bug #11414 (Closed): augeas provider version checks fails when version >0.9
released in 2.7.10rc1
Michael Stahnke
03:00 pm Bug #11408 (Closed): Windows fact and pluginsync are broken
released in 2.7.10rc1 Michael Stahnke
03:00 pm Bug #11404 (Closed): Indentation gets borked when generating the @doc string for a type's :provid...
released in 2.7.10rc1 Michael Stahnke
02:59 pm Bug #11333 (Closed): Incorrect Puppet::Type.ensurable? behaviour
released in 2.7.10rc1 Michael Stahnke
02:59 pm Feature #11318 (Closed): [Patch] Add the manages_passwords feature for users on FreeBSD
released in 2.7.10rc1 Michael Stahnke
02:59 pm Bug #11293 (Closed): Password parameter for the User resource is broke in OS X version 10.7
released in 2.7.10rc1 Michael Stahnke
02:58 pm Bug #11291 (Closed): Configuration reference for show_diff is incorrect as of 845825a
released in 2.7.10rc1 Michael Stahnke
02:57 pm Refactor #11996 (Closed): Spec test failures in 1.8.7p357 due to hash ordering changes...
Reviewed and merged by Josh, and then shipped in 2.7.10. Anonymous
02:56 pm Feature #11990: PuppetDoc should use also README.rdoc files
Brice Figureau wrote:
> Alessandro Franceschi wrote:
> > I attach the patch in a more readable format... sorry for ...
Anonymous
02:54 pm Bug #11246 (Closed): Puppet should work with UTF-8 encoded ERB templates
released in 2.7.10rc1 Michael Stahnke
02:54 pm Feature #7788: Puppet should allow rubygems to deliver new functionality
R.I. Pienaar wrote:
> I think it still has value, unless you also let us control what gets pluginsynced to what plac...
Anonymous
02:54 pm Bug #11198 (Closed): Modules generated by PMT should have a default license
released at 2.7.10rc1 Michael Stahnke
02:52 pm Feature #11046 (Closed): Improve user and group pw providers on FreeBSD
released in 2.7.10rc1 Michael Stahnke
02:52 pm Bug #10962 (Closed): The pw user provider on FreeBSD doesn't respect managehome when changing a u...
released in 2.7.10rc1 Michael Stahnke
02:51 pm Feature #10940 (Closed): puppet apply --apply <catalog> should be deprecated in favor of puppet a...
released in 2.7.10rc1 Michael Stahnke
02:51 pm Bug #10807 (Closed): SMF provider should use svcadm with -s option
released in 2.7.10rc1 Michael Stahnke
02:51 pm Bug #10676 (Closed): last run summary is an inconsistent data structure
released in 2.7.10rc1 Michael Stahnke
02:50 pm Bug #10586 (Closed): Windows puppet cannot source files remotely if owner and group are not speci...
released in 2.7.10rc1 Michael Stahnke
02:50 pm Bug #10321 (Closed): Schedule type range parameter array support isn't working
Released 2.7.10rc1 Michael Stahnke
02:49 pm Bug #10109 (Closed): Composite keys cause Invalid parameter false error
released as part 2.7.10rc1 Michael Stahnke
02:47 pm Bug #10066: puppet agent --fingerprint should not daemonize
Released in 2.7.10rc1 Michael Stahnke
02:46 pm Bug #11057: Better debugging output when skipping an agent/master run.
# Targeting 2.7.11 #
Missed the 2.7.10rc1 by a few minutes so I'm re-targeting this at 2.7.11.
Jeff McCune
02:34 pm Bug #11888: Oracle keeps renaming their Linux version
This is remerged, targetted to telly, because raising the minimum version of Facter required in a stable series is no... Anonymous
02:31 pm Bug #11057 (Merged - Pending Release): Better debugging output when skipping an agent/master run.
# Merged into 2.7.x #
Merged into 2.7.x as <https://github.com/puppetlabs/puppet/commit/e78dc4cfa7c3eeaba9c1c5115c...
Jeff McCune
01:23 pm Bug #11499 (Merged - Pending Release): validation code for puppet resource host does not properly...
# Merged into 2.7.x #
Merged into 2.7.x as <https://github.com/puppetlabs/puppet/commit/c8f5cd6d1a43f07cabeba29940...
Jeff McCune
12:54 pm Bug #11968: Potentially unsafe CWD handling in Puppet, from various sources
Sorry, to be more clear: both the file and exec resources above are in this same .pp file. I can't remember if other... Steve Shipway
12:53 pm Bug #11845 (Duplicate): exec's as non-root user execute with a mixed environment
I found the duplicate, #5224, and have linked the two tickets together. Anonymous
12:52 pm Bug #11968: Potentially unsafe CWD handling in Puppet, from various sources

exec { "etc-services-nrpe":
command=>"echo 'nrpe 5666/tcp nagios netsaint' >> /etc/services",
...
Steve Shipway
12:20 pm Feature #11318 (Merged - Pending Release): [Patch] Add the manages_passwords feature for users on...
Merged in https://github.com/puppetlabs/puppet/commit/75d7cad19be95760bc08e2ce4a67208aec5c6af7 Patrick Carlisle
12:20 pm Bug #7500 (Merged - Pending Release): Don't let pw provider use -p
Merged in https://github.com/puppetlabs/puppet/commit/75d7cad19be95760bc08e2ce4a67208aec5c6af7 Patrick Carlisle
12:19 pm Bug #10962 (Merged - Pending Release): The pw user provider on FreeBSD doesn't respect managehome...
Merged in https://github.com/puppetlabs/puppet/commit/75d7cad19be95760bc08e2ce4a67208aec5c6af7 Patrick Carlisle
11:39 am Bug #11968: Potentially unsafe CWD handling in Puppet, from various sources
Hi Steve,
can you please paste your exec resource `Exec['etc-services-nrpe]`? And does `etc/puppet/dev/modules/nrp...
Stefan Schulte
11:12 am Bug #11220: execute bits for directories are not being added
This is a dupe of #10269 Garrett Honeycutt
11:09 am Puppet Dashboard Bug #5879 (Closed): url column on nodes should go away
Released in Dashboard 1.2.5rc1 Matthaus Owens
10:56 am Facter Bug #10271 (Closed): Amazon Linux operatingsytem and operatingsystemrelease and osfamily facts do...
Released in 1.6.5rc1 Matthaus Owens
10:55 am Facter Bug #11583 (Closed): ec2 fact has no unit tests
Released in 1.6.5rc1 Matthaus Owens
10:55 am Facter Bug #11661 (Closed): ec2 tests use 'throws' instead of 'raises' for timeout emulation
Released in 1.6.5rc1 Matthaus Owens
10:55 am Facter Bug #11848 (Closed): facter.bat cannot be relocated on Windows
Released in 1.6.5rc1 Matthaus Owens
10:55 am Facter Bug #7753 (Closed): Errors when adding a resolve should not crash facter
Released in 1.6.5rc1 Matthaus Owens
10:54 am Facter Bug #8279 (Closed): ec2_security_groups concatenates multiple groups instead of separating by a c...
Released in 1.6.5rc1 Matthaus Owens
10:54 am Facter Feature #9599 (Closed): Add Nexenta to operatingsystem fact
Released in 1.6.5rc1 Matthaus Owens
10:54 am Facter Refactor #9708 (Closed): Remove redundancy from operatingsystem confines
Released in 1.6.5rc1 Matthaus Owens
10:54 am Facter Feature #9789 (Closed): Improved test coverage for operatingsystem
Released in 1.6.5rc1 Matthaus Owens
10:53 am Facter Feature #11201 (Closed): Add a rake task to build Apple Packages
Released in 1.6.5rc1 Matthaus Owens
10:46 am Facter Feature #11566 (Closed): Windows EC2 meta data support
Released in 1.6.5rc1 Matthaus Owens
10:46 am Facter Bug #11559 (Closed): Use RbConfig instead of obsolete and deprecated Config.
Released in 1.6.5rc1 Matthaus Owens
10:46 am Facter Bug #11436 (Closed): The total amount of memory uses a different fact on the Mac than on Linux
Released in 1.6.5rc1 Matthaus Owens
10:46 am Facter Feature #11328 (Closed): Provide OpenBSD Facter support for uptime & virtual facts
Released in 1.6.5rc1 Matthaus Owens
10:45 am Facter Bug #11196 (Closed): EC2 facts do not get created when the arp table contains more than 1 entry (...
Released in 1.6.5rc1 Matthaus Owens
10:45 am Facter Refactor #10309 (Closed): Standardize fixture handling using Puppets methodology
Released in Facter 1.6.5rc1 Matthaus Owens
10:30 am Bug #11995: Add group install to Package
That is a very good point and explains why it wasn't in there yet. Some code around doing a "yum groupinfo <%= GROUP... Charlie Wyse
10:18 am Feature #11727: Add stdin parsing to puppet parser validate
Test looks good; commented on pull request as well. Dominic Maraglia
08:21 am Facter Feature #1424: Zone facts for Solaris
the reason for having zones as a fact is to be able to gather information about the zones you have running on a syste... Martin Englund
01:58 am Feature #7788: Puppet should allow rubygems to deliver new functionality
I think it still has value, unless you also let us control what gets pluginsynced to what places. With gems if we wa... R.I. Pienaar
12:24 am Feature #11990: PuppetDoc should use also README.rdoc files
Alessandro Franceschi wrote:
> I attach the patch in a more readable format... sorry for the mess
I will produce ...
Brice Figureau
12:19 am Feature #11044: Puppet agent should fork when applying the catalog
Daniel Pittman wrote:
> It sounds like this is generally satisfactory to everyone, if we target Telly?
>
> This i...
Brice Figureau
12:12 am Bug #11995: Add group install to Package
Imho this was already discussed a couple of times (mailing list, probably also bugtracker). One (big) issue is that y... Peter Meier
12:10 am Bug #11988: Augeas provider can clobber symlinks
In my experience this can hit you quite badly, as RHEL (and its derivates) for example have a symlink for grub.conf. ... Peter Meier
12:07 am Bug #11984: improperly configured storeconfigs do not return valuable exit codes
Imho it is fine if the exit code 0, as it is only a warning and imho it actually doesn't happen during a transaction,... Peter Meier
10:01 pm Refactor #11996 (In Topic Branch Pending Review): Spec test failures in 1.8.7p357 due to hash ord...
https://github.com/puppetlabs/puppet/pull/344
https://github.com/puppetlabs/puppet/pull/342
Those cover the 2.6 a...
Anonymous
09:19 pm Feature #11802: Puppet Module Tool (PMT) should have a list command
This was merged into 2.7.x in <https://github.com/puppetlabs/puppet/commit/8b3e440d5e9fcd23ace0789f33327d1c6a68b333> Josh Cooper
09:16 pm Feature #11803: Puppet Module Tool (PMT) should have an uninstall command
This was merged into 2.7.x in <https://github.com/puppetlabs/puppet/commit/96e79835e3724edf582b1081b01df2f5a6798303> ... Josh Cooper
08:53 pm Puppet Community Package Repository Feature #11701: Adding support for SourceForge distribution
Sorry if I'm being thick ... what's the decision that's needed? Anonymous
07:46 pm Bug #11888 (In Topic Branch Pending Review): Oracle keeps renaming their Linux version
# Reverted for 2.7.x #
Pull Request: <https://github.com/puppetlabs/puppet/pull/340>
As a reminder, once merged...
Jeff McCune
07:40 pm Feature #11046 (Merged - Pending Release): Improve user and group pw providers on FreeBSD
Anonymous
07:33 pm Bug #11888: Oracle keeps renaming their Linux version
Note, this has to be done ASAP to make the 2.7.10 release. Jeff McCune
07:32 pm Bug #11888 (Code Insufficient): Oracle keeps renaming their Linux version
# Wrong Integration Branch #
This was merged into 2.7.x and it shouldn't have been because Mike points out it brea...
Jeff McCune
07:14 pm Feature #11044 (Needs Decision): Puppet agent should fork when applying the catalog
It sounds like this is generally satisfactory to everyone, if we target Telly?
This is more or less the last chanc...
Anonymous
07:11 pm Feature #11803 (Merged - Pending Release): Puppet Module Tool (PMT) should have an uninstall command
Kelsey Hightower
07:09 pm Feature #9879: Puppet resource hash support
Nan Liu wrote:
> Yeah, I'll take another shot at this over this weekend since it's very helpful for the current proj...
Anonymous
07:00 pm Refactor #11996 (Closed): Spec test failures in 1.8.7p357 due to hash ordering changes...
Now the hash order changes when Ruby is run, some tests are failing because they look to be dependent on the order in... Anonymous
05:13 pm Feature #11802 (Merged - Pending Release): Puppet Module Tool (PMT) should have a list command
Kelsey Hightower
04:55 pm Bug #7422: undefined method `<<' for {}:Hash when combining resource chaining, metaparameters, an...
We're hitting this in 2.7.6 (Puppet Enterprise 2.0.0) and are working around it for now. Relates to #6748? Chad Metcalf
04:43 pm Bug #7917: Puppet apply runmode should write classes.txt file
Keen to see a solution found for this. I am not sure if its viable but could the apply application just by default n... R.I. Pienaar

01/17/2012

03:54 pm Bug #11995 (Duplicate): Add group install to Package
This is my first ticket so if I do anything wrong let me know. When trying to install a package group in Red Hat 6, ... Charlie Wyse
03:50 pm Feature #11994 (Rejected): Package resource: chroot/jail path
Puppet 2.7.9
CentOS 5.x / CentOS 6.x
I currently have to create a custom type in order to provide support for ins...
Mike McLane
03:34 pm Facter Bug #11511: fact "architecture" picks up x86_64 rather than amd64
Srikrishna Das wrote:
> **For "#12"**
>
>
> root@box:/etc/puppet# vi test.pp
> root@box:/etc/puppet# p...
Adrien Thebo
03:31 pm Facter Bug #11511: fact "architecture" picks up x86_64 rather than amd64
Matt Taggart wrote:
> Removing the files on the puppetmaster and running puppet on the client results in new files b...
Adrien Thebo
03:23 pm Bug #7141: puppetd runs fail in 'daemon' mode when stat'ing /proc files
In case anybody else finds this issue, Red Hat released the following errata for RHEL 5.7 containing the fix: [RHSA-2... Dominic Cleal
02:29 pm Bug #11958 (Merged - Pending Release): obscure error message from pip package provider when pytho...
Kelsey Hightower
02:08 pm Feature #11990: PuppetDoc should use also README.rdoc files
I attach the patch in a more readable format... sorry for the mess Alessandro Franceschi
02:06 pm Feature #11990 (Duplicate): PuppetDoc should use also README.rdoc files
This is a feature request for which there's already a solution.
Hope you will review and eventually accept it.
Pu...
Alessandro Franceschi
02:04 pm Feature #11865: Package providers that support a "source" parameter should allow for puppet:/// U...
Kelsey Hightower wrote:
> @jeff +1 on this. If that makes it easier for new people, cool. Would Puppet do anything t...
Jeff McCune
01:50 pm Bug #11988 (Accepted): Augeas provider can clobber symlinks
Code inspection confirms this: the provider isn't taking sufficient care to get at the final target file. Thanks for... Anonymous
01:48 pm Bug #11989 (Accepted): upstart service operating system confine should include redhat and centos
Anonymous
01:47 pm Puppet Community Package Repository Feature #11701 (Needs Decision): Adding support for SourceForge distribution
Anonymous
01:47 pm Puppet Dashboard Feature #11853 (Needs More Information): Puppet Dashboard : Validation failed: Host already has a...
Hey. It looks like you might be running the import task after you configured the master to send reports into Dashboa... Anonymous
01:45 pm Puppet Dashboard Feature #11882 (Needs Decision): Add/Edit node parameters via rake task
Chris Blumentritt wrote:
> I would like to add/edit node parameters programmatically. For classes and groups I have...
Anonymous
01:37 pm Facter Feature #11969 (Needs More Information): Solaris zfs/zpool version detection
Anonymous
01:37 pm Facter Feature #11969 (Needs Decision): Solaris zfs/zpool version detection
In the Illumos community, which is more or less the upstream point for this code in the open source community, they a... Anonymous
01:24 pm Feature #11967: split() function does not work on array variables
+1 on everyone is not a Ruby coder. I'll leave this ticket open for additional feedback form others. Kelsey Hightower
01:01 pm Feature #11967: split() function does not work on array variables
While I agree that the standard split() function is designed and documented to be only for use on strings (and not ar... Steve Shipway
12:52 pm Bug #11968: Potentially unsafe CWD handling in Puppet, from various sources
My problem with this is not so much that the file{} resource fails (though an error of the form "use 'link' option to... Steve Shipway
12:39 pm Bug #11989 (Code Insufficient): upstart service operating system confine should include redhat an...
RedHat EL 6 and Centos 6 both use upstart for init. The upstart service type should be able to be used on those syst... Nathan Huff
12:36 pm Feature #11900: Dynamic environment interpolation in puppet master configuration
Nigel,
We have a pretty good use case going here, care to weigh in?
Kelsey Hightower
12:32 pm Bug #11988 (Closed): Augeas provider can clobber symlinks
If the augeas resource is fed a symlink as the target file and it
makes changes it will overwrite it with a regular ...
Nathan Huff
12:29 pm Feature #11900: Dynamic environment interpolation in puppet master configuration
This is under Puppet 2.7.9 under CentOS 5.x and CentOS 6.x.
<br>
I am trying to keep to a design pattern where a type...
Mike McLane
12:18 pm Bug #11958 (In Topic Branch Pending Review): obscure error message from pip package provider when...
Ok, I have updated my branch and all tests should be passing now:
$ rspec spec/integration/provider/package_sp...
Kelsey Hightower
11:40 am Bug #11984 (Accepted): improperly configured storeconfigs do not return valuable exit codes
Anonymous
11:39 am Bug #11958 (Tests Insufficient): obscure error message from pip package provider when python-pip ...
Anonymous
11:39 am Bug #11958: obscure error message from pip package provider when python-pip is not installed
I get a failure in the package acceptance tests in the suite:... Anonymous
11:37 am Bug #11984 (Accepted): improperly configured storeconfigs do not return valuable exit codes
Noticed this while writing tests:... Justin Stoller
11:30 am Feature #11727: Add stdin parsing to puppet parser validate
Dominic Maraglia wrote:
> Review complete. Comments added to pull request.
Thanks, tyop fixed, can you validate ...
Anonymous
11:06 am Puppet Acceptance Feature #5519 (Closed): Git based install in harness
This was merged into master in <https://github.com/puppetlabs/puppet-acceptance/commits/4de830bdcc75bc08802564b96d15c... Josh Cooper
10:58 am Facter Bug #11732 (Duplicate): Facter (in 1.6.x) is broken on Windows
Fixed by #11566. Thanks Josh. Ken Barber
10:51 am Facter Feature #11566 (Merged - Pending Release): Windows EC2 meta data support
This was merged in <https://github.com/puppetlabs/facter/commit/184224a01b40a04848c3432367e22ee8391b74ca>:... Josh Cooper
10:51 am Facter Bug #11695 (Code Insufficient): factor comments
I have reviewed the content, and a bunch of the documentation needs work. Comments were sent through the GitHub inte... Anonymous
10:36 am Facter Feature #11307: Deprecate the arp fact
Adrien Thebo wrote:
> Changing the behavior of this fact is fairly backwards incompatible, so even if it isn't that ...
Anonymous
10:34 am Facter Bug #11695: factor comments
Opened a Pull request for additional comments in facter/lib in the ssvarma:11695factordoc area. Had previously mistak... shubhra sinha varma
10:28 am Puppet Forge Feature #11979 (Closed): Update existing Forge API - dependency metadata
We need to update the existing Forge REST APIs to support getting all available versions for a specific release and g... Kelsey Hightower
10:24 am Puppet Acceptance Feature #11767 (Accepted): Acceptance tests don't run on Windows
I'll send out a pull request later today for the other parts. Josh Cooper
10:12 am Puppet Acceptance Feature #11767 (Re-opened): Acceptance tests don't run on Windows
# Re-opening #
I didn't see "Merged Pending release"
I don't think this ticket should be closed yet. Or, if it...
Jeff McCune
10:11 am Puppet Acceptance Feature #11767 (Closed): Acceptance tests don't run on Windows
# Merged into master #
Merged into master as <https://github.com/puppetlabs/puppetlabs-sshkeys/commit/c79a17f380d0...
Jeff McCune
09:55 am Bug #6771: Mysterious ActiveRecord disk I/O Error
We should probably move that into the base spec_helper before and after blocks, since this is a global resource that ... Anonymous
09:50 am Bug #6771: Mysterious ActiveRecord disk I/O Error
This occurs when the db connection is not closed between tests. See commit:7e9707a7d7b357d9b5167c6dd0dd250ab207f6ac
...
Josh Cooper
09:45 am Feature #11865: Package providers that support a "source" parameter should allow for puppet:/// U...
@jeff +1 on this. If that makes it easier for new people, cool. Would Puppet do anything to enforce this as a standar... Kelsey Hightower
09:42 am Feature #11865: Package providers that support a "source" parameter should allow for puppet:/// U...
@kelsey I think doing as much as we can to help keep things in order is a great idea. Based on the difficulty teachi... Jeff McCune
09:24 am Feature #11900: Dynamic environment interpolation in puppet master configuration
Eric Sorenson wrote:
> Kelsey -- correct me if I'm wrong, but I believe ENC evaluation happens *after* environment d...
Kelsey Hightower
09:18 am Feature #11727: Add stdin parsing to puppet parser validate
Review complete. Comments added to pull request. Dominic Maraglia
09:17 am Feature #11881 (Rejected): resource collection matching should support regex
tags do accomplish the same thing Dan Bode
09:07 am Feature #11900: Dynamic environment interpolation in puppet master configuration
Kelsey Hightower wrote:
> You could use custom facts on each node to set `$group`, `$releasecycle`, and `$product`...
eric sorenson
08:46 am Bug #11929: Cannot serve local binary files on Windows
This was merged into 2.7.x in <https://github.com/puppetlabs/puppet/commit/f4f4158f673b911fb95d5dbb1a6f0eff8387bdbc> Josh Cooper
08:35 am Bug #11921: Puppet not building proper Nagios configs with Exported Resources
Well, the first issue here isn't actually Nagios-specific. In my comment I added I demonstrate an instance of it happ... Mark Frost
08:19 am Bug #11921: Puppet not building proper Nagios configs with Exported Resources
Mark,
Thanks for reporting this issue, I have never used the nagios type, so I don't have any good suggestions on ...
Kelsey Hightower
08:15 am Feature #11865: Package providers that support a "source" parameter should allow for puppet:/// U...
I wonder if we should look in a set of subdirectories by convention to help endusers keep things in order:
pac...
Kelsey Hightower
08:06 am Bug #11968: Potentially unsafe CWD handling in Puppet, from various sources
Steve,
Thanks for reporting this issue. I do have one quick question that will help us improve the error message. ...
Kelsey Hightower
07:59 am Feature #11967 (Rejected): split() function does not work on array variables
Nigel,
I am suggesting that this feature be rejected as there are other ways to achieve the desired results withou...
Kelsey Hightower
07:57 am Feature #11967: split() function does not work on array variables
Steve,
Thanks for reporting this issue. Although I see the utility in your use case, I believe the split function ...
Kelsey Hightower
07:48 am Bug #11830: API REST doesn't interpret environment
Kelsey Hightower wrote:
> Jonas, have you had a chance to look over the docs? Is this still and issue for you?
Hi...
Jonas Rockenbauer
07:46 am Bug #7754: pip provider does not detect existance of system installed packages
Go ahead and reject this. Things are a lot different with -i
pip freeze | grep -i xenapi
XenAPI==1.2
Chris Blumentritt
07:44 am Feature #11875: warning for "Could not look up qualified variable 'foo::bar' " should report the ...
Daniel Pittman,
Can you provide some insight on how best to approach this issue? I'm thinking about trying to fix ...
Kelsey Hightower
07:42 am Feature #11875: warning for "Could not look up qualified variable 'foo::bar' " should report the ...
Daniel,
Thanks for reporting this issue. I agree that better error message here will make the world of difference...
Kelsey Hightower
07:39 am Bug #11830 (Needs More Information): API REST doesn't interpret environment
Jonas, have you had a chance to look over the docs? Is this still and issue for you? Kelsey Hightower
07:37 am Feature #11881 (Needs More Information): resource collection matching should support regex
Dan,
Does Brice's suggestion makes sense to you? Do you think this is still an issue worth resolving?
Kelsey Hightower
07:35 am Feature #11900 (Needs More Information): Dynamic environment interpolation in puppet master confi...
Kelsey Hightower
07:33 am Feature #11900: Dynamic environment interpolation in puppet master configuration
Mike,
Thanks for reporting this issue. I have a couple of questions:
* What version of Puppet are your running?...
Kelsey Hightower
07:32 am Bug #3299: owner of files created by nagios resource types
Here's what I'm doing in order to have each resource change properly permissioned with service restart notification:
...
Justin Honold
07:22 am Bug #11958 (In Topic Branch Pending Review): obscure error message from pip package provider when...
## Pending review ##
Changes are ready for review - [Pull Request: 337](https://github.com/puppetlabs/puppet/pull/...
Kelsey Hightower
06:04 am Bug #11958 (Accepted): obscure error message from pip package provider when python-pip is not ins...
Taking a look at this now. Kelsey Hightower
10:57 pm Facter Feature #1424: Zone facts for Solaris
zone, and zone state can be managed as puppet resources so not sure about the additional value of having facts. Could... Nan Liu
08:52 pm Facter Bug #11511: fact "architecture" picks up x86_64 rather than amd64
**For "#12"**
root@box:/etc/puppet# vi test.pp
root@box:/etc/puppet# puppet apply test.pp
notice: ...
Srikrishna Das
08:43 pm Facter Bug #11511: fact "architecture" picks up x86_64 rather than amd64
For "#11" from my box ('find' takes up a lot of time because its a huge disk and huge NAS mounted.. cant unmount.)
R...
Srikrishna Das
07:52 pm Facter Feature #11969 (Closed): Solaris zfs/zpool version detection
For the Solaris ZFS provider since there are several changes in different version. It would be beneficial to detect Z... Nan Liu
07:11 pm Facter Feature #6682: Solaris LDOM facts
I think virtinfo is the most reliable command. It's available on Solaris 11 in system/core-os, Solaris 9/10 in SUNWcs... Nan Liu
06:38 pm Bug #11968 (Needs Decision): Potentially unsafe CWD handling in Puppet, from various sources
If the location pointed to by source=> in a file{} resource is a softlink, and you do not have links=>follow, then yo... Steve Shipway
04:41 pm Facter Feature #10966 (Tests Insufficient): Add bios information to facter
Pull request is here:
<https://github.com/puppetlabs/facter/pull/144>
We'll need tests.
Ken Barber

01/16/2012

03:22 pm Bug #6847: Cannot read client $noop setting
Any update on this? We would really find this functionality useful (being able to read $noop state from manifest or ... Steve Shipway
03:17 pm Bug #7754: pip provider does not detect existance of system installed packages
This affects me on Debian Squeeze, puppet 2.7.9, python 2.6.6. The version of pip according to dpkg is 0.7.2-1 Chris Blumentritt
03:05 pm Feature #11967 (Needs Decision): split() function does not work on array variables
The split() function results in an error message if the first parameter is an array.
While this usage may not have b...
Steve Shipway
02:49 pm Facter Bug #11511: fact "architecture" picks up x86_64 rather than amd64
Removing the files on the puppetmaster and running puppet on the client results in new files being created where arch... Matt Taggart
02:21 pm Facter Bug #11511: fact "architecture" picks up x86_64 rather than amd64
If you remove the two files on your puppetmaster and run puppet on your agent again, puppet should recreate the files... Stefan Schulte
01:53 pm Facter Bug #6470: Ubuntu server architecture detected as "x86_64" while it should be "amd64"
In comment 6 micah wonders why there are both architecture and hardwaremodel. I suspect it's more useful on other arc... Matt Taggart
01:44 pm Facter Bug #11511: fact "architecture" picks up x86_64 rather than amd64
I'm also seeing this on Debian 'squeeze'. I did the tests suggested in #12,
notice: Architecture fact = amd64
not...
Matt Taggart
11:18 am Bug #11965 (Closed): Hiera can't find any data
R.I. Pienaar gave me a head's up, and this ticket is a duplicate of http://projects.puppetlabs.com/issues/10975.
...
Mark Frost
10:28 am Bug #9145: error message is not clear when puppet agent runs out of disk space during cert genera...
Sure, I understand!
My only suggestion then would be to just make the file handling more robust so it skips files ...
Ryan Conway
10:17 am Facter Feature #11663: Add FreeBSD support to blockdevice fact(s)
Thanks Adrian!
I'm going to work with the blockdevices_spec.rb and I'll see how far I can get.
I may have a few...
Mike Carlson
10:05 am Facter Bug #9482 (Accepted): Fact virtual and is_virtual wrong for Solaris VM inside KVM/QEMU
I don't see a pull request for this. Ken Barber
09:59 am Facter Bug #11695 (Needs More Information): factor comments
Hi,
Was there a pull request for this somewhere? Can you paste it in the ticket? Also - what version was this targ...
Ken Barber
09:57 am Facter Bug #11848 (Merged - Pending Release): facter.bat cannot be relocated on Windows
Merged by dpittman here:
<https://github.com/puppetlabs/facter/commit/d6ac4ab2b7962f3f958b37f5b0f8d2007ecab613>
Ken Barber
09:48 am Bug #11965 (Closed): Hiera can't find any data
I'm struggling how to describe this ticket other than "Hiera doesn't work". I've been trying to get it set up to use ... Mark Frost
08:53 am Bug #4694: Storeconfig issue with AR/MySQL
Daniel - which ticket is it a duplicate of? James Turnbull
06:19 am Bug #11964 (Rejected): Access a double nested hash from custom function fails
Not a bug - bug in my manifests! Lewis Marshall
05:24 am Bug #11964: Access a double nested hash from custom function fails
Sorry - didn't preview the bug - can the mark-up be edited? Lewis Marshall
05:20 am Bug #11964 (Rejected): Access a double nested hash from custom function fails
Trying to access a doubly nested hash returned from a custom function results in the error:
`err: Could not retrie...
Lewis Marshall

01/15/2012

09:49 am Bug #11961 (Accepted): pypi is down leading to "Could not run Puppet configuration client: execut...
We'll need to wrap something in the def latest block to check if the site is up.... James Turnbull
06:56 am Bug #11961 (Closed): pypi is down leading to "Could not run Puppet configuration client: executio...
Hi,
Currently, pypi.python.org is down, it seems like the puppet-pip package provider is failing because of that ....
Ahmed El Gamil

01/14/2012

09:50 am Bug #11958 (Closed): obscure error message from pip package provider when python-pip is not insta...
Hi,
Puppet generates an obscure error when the pip command is not installed or not in PATH.
Error is like :
[...
Ahmed El Gamil
 

Also available in: Atom